{"text_format":"1","workbook":"xlsx","n_sheets":15,"sheets":["Steuerung","ANDaten1","ANDaten2","ANDaten3","GehaltsL1","GehaltsL2","Kontierung","PersKarte","LGAbrechnung","Lohnsteuer","SozialV","Urlaub","Briefe","Steuer","Steuer2017"],"not_rendered":{"charts":0,"images":22,"macros":1,"external_links":0,"defined_names":5,"comments":3,"pivot_tables":0},"unopened":[],"bounds":{"document_bytes":16777216,"sheet_cells":100000,"rows_first":2000,"rows_last":500,"rows_between":2000,"halvings":0,"cell_chars":16384,"cell_head_chars":4096},"cells_cut":0,"cells_raw":0,"read":"whole","date_system":"1900"}

{"sheet":"Steuerung","index":0,"n_rows":29,"n_cols":8,"rows_kept":29,"cut":false,"hidden":false,"merged":[[1,1,2,6],[15,1,16,2],[15,5,16,6],[14,5,14,6],[9,3,12,4],[8,5,8,8],[8,1,12,2],[14,1,14,2],[14,3,14,4],[14,7,14,8],[21,7,23,8],[25,7,25,8],[3,1,4,4],[3,5,4,6],[8,3,8,4],[5,1,6,6],[21,1,23,2],[21,3,23,4],[21,5,23,6],[18,1,18,8]]}
[]
[null,"Tropic GmbH, Rheingrafenstr. 20, 55543 Bad Kreuznach"]
[]
[null,"Personalbuchhaltung",null,null,null,"Gehaltsempfänger"]
[]
[null,"Klicken Sie auf die Buttons um Aufgaben in den entsprechenden Bereichen zu erledigen."]
[]
[]
{"$rows_left_out":22}
{"sheet":"ANDaten1","index":1,"n_rows":37,"n_cols":23,"rows_kept":37,"cut":false,"hidden":false,"merged":[[1,0,1,1]]}
[]
["Arbeitnehmerdaten 1",null,"Personendaten eigeben"]
["Personendaten",null,"1. Schaltfläche 'Arbeitnehmerdaten' anklicken "]
[null,null,"2. Personalnummer, Name und Vorname der Mitarbeiterin/des Mitarbeiters eingeben"]
[null,null,"3. Dateneingabe nach Klick auf Button 'Daten'"]
[]
["Personalnummer","Name","Vorname","Straße/Hausnummer","PLZ","Wohnort","Telefon","mobil","Fax","Email","Eintrittsdatum","Geburtsdatum","Geburtsort","Geschlecht","Familienstand","Kinderzahl","Staatsangehörigkeit","Konfession","Konf. Ehegatte","Steuermerkmale","Funktion","Bildungsabschluss","Ausbildung"]
[100,"Sommer","Sylvia","Sonnenhöhe",55543,"Bad Kreuznach","06711526","017045549876","0671152-12","syliva.sommer@tropic.de","1980-01-01","1954-07-12","Bad Kreuznach","weiblich","verheiratet",2,"deutsch","evangelisch","katholisch",{"$f":"IF(A8=\"\",\"\",CONCATENATE(IF(R8=\"evangelisch\",\"ev\",IF(R8=\"katholisch\",\"rk\",\"-\")),\"/\",IF(S8=\"evangelisch\",\"ev\",IF(S8=\"katholisch\",\"rk\",\"-\"))))","v":"ev/rk"},"Geschäftsführerin","Dipl.-Betriebswirtin","Studium"]
{"$rows_left_out":30}
{"sheet":"ANDaten2","index":2,"n_rows":37,"n_cols":20,"rows_kept":37,"cut":false,"hidden":false,"merged":[[1,0,1,1],[2,0,2,1]]}
[]
["Arbeitnehmerdaten 2",null,"Personendaten eigeben"]
["Gehaltsdaten",null,"1. Schaltfläche 'Arbeitnehmerdaten' anklicken "]
[null,null,"2. Personalnummer, Name und Vorname der Mitarbeiterin/des Mitarbeiters eingeben"]
[null,null,"3. Dateneingabe nach Klick auf Button 'Daten'"]
[]
["Personalnummer","Name","Vorname","Kreditinstitut","Bankleitzahl","Kontonummer","Steuerklasse","Kinderfreibetrag","Steuerfreibetrag","Gehaltsgruppe","Vertragsgehalt","Urlaubsgeld","monatl. Prämien","vwL AG","vwL AN","sonstige Abzüge","Kirchensteuersatz","Finanzamt","Vermögensbildung","Vertragsnummer"]
[{"$f":"ANDaten1!A8","v":100},{"$f":"ANDaten1!B8","v":"Sommer"},{"$f":"ANDaten1!C8","v":"Sylvia"},"Sparkasse Hannover",25050180,123456,4,1,0,"F1",8500,500,null,0,0,null,0.09,"Hannover"]
{"$rows_left_out":30}
{"sheet":"ANDaten3","index":3,"n_rows":37,"n_cols":9,"rows_kept":37,"cut":false,"hidden":false,"merged":[[1,0,1,1],[2,0,2,1]]}
[]
["Arbeitnehmerdaten 3",null,"Personendaten eigeben"]
["Arbeitszeitdaten",null,"1. Schaltfläche 'Arbeitnehmerdaten' anklicken "]
[null,null,"2. Personalnummer, Name und Vorname der Mitarbeiterin/des Mitarbeiters eingeben"]
[null,null,"3. Dateneingabe nach Klick auf Button 'Daten'"]
[]
["Personalnummer","Name","Vorname","Wochenarbeitszeit/Stunden","Urlaubsanspruch/Tage","Resturlaub/Tage","Krankheitstage","sonstige Fehlzeiten","Begründung"]
[{"$f":"ANDaten1!A8","v":100},{"$f":"ANDaten1!B8","v":"Sommer"},{"$f":"ANDaten1!C8","v":"Sylvia"},null,34,5]
{"$rows_left_out":30}
{"sheet":"GehaltsL1","index":4,"n_rows":38,"n_cols":27,"rows_kept":38,"cut":false,"hidden":false,"merged":[[5,15,5,21],[1,3,1,4],[37,0,37,2],[1,5,3,7],[1,0,1,2],[5,3,5,5]]}
[]
["Gehaltsliste",null,null,null,null,"Klicken Sie auf den Button und geben Sie Monat Jahr ein. Nehmen Sie ggf. Änderungen bei den Personaldaten vor",null,null,null,null,null,null,null,null,null,null,"ja"]
["Daten der Personalbuchhaltung",null,null,null,null,null,null,null,null,null,null,null,null,null,null,null,"nein"]
[]
["Abrechnungsmonat:",null,"Januar","Abrechnungsjahr:",2017,null,null,null,null,null,null,null,null,null,null,null,null,2.5000000000000001E-3]
["Personal-",null,null,"Steuermerkmale",null,null,null,null,null,null,null,null,null,null,null,"Sozialversicherung",null,null,null,null,null,null,null,null,"Vorschüsse und"]
["Nummer","Name","Vorname","Steuerklasse","Religion","Kinder","Vertragsgehalt","Urlaubsgeld","monatl. Prämien","vwLAG","Bruttogehalt","Lohnsteuer","SolZ","Kirchensteuer","Steuer gesamt","KrankenV.","kinderlos; >23","Zusatzbeitrag","PflegeV.","RentenV.","ArbeitslosenV.","SozVers.","Nettogehalt","vwLAN","sonstige Abzüge","Auszahlung","AGAnteilSozVers"]
[{"$f":"ANDaten1!A8","v":100},{"$f":"ANDaten1!B8","v":"Sommer"},{"$f":"ANDaten1!C8","v":"Sylvia"},{"$f":"ANDaten2!G8","v":4},{"$f":"ANDaten1!R8","v":"evangelisch"},{"$f":"ANDaten2!H8","v":1},{"$f":"ANDaten2!K8","v":8500},{"$f":"IF(C5=\"Juli\",ANDaten2!L8,0)","v":0},{"$f":"ANDaten2!M8","v":0},{"$f":"ANDaten2!N8","v":0},{"$f":"SUM(G8:J8)","v":8500},{"$f":"IF(A8=\"\",\"\",Steuer2017!B$230/100)","v":2760.91},null,{"$f":"IF(A8=\"\",\"\",IF(OR(E8=\"evangelisch\",E8=\"katholisch\"),TRUNC(Steuer2017!B$265*ANDaten2!Q8/100,2),0))","v":236.89},{"$f":"SUM(L8:N8)","v":2997.7999999999997},{"$f":"IF($A8=\"\",\"\",IF(SozialV!E8=0%,0,IF($K8>SozialV!$G8,((SozialV!$G8*SozialV!$E8/2)+(SozialV!$G8*SozialV!$E$6)),($K8*SozialV!$E8/2)+($K8*SozialV!$E$6))))","v":0},"nein",{"$f":"IF(OR(Q8=\"nein\",Q8=\"\"),\"\",$R$5)","v":""},{"$f":"IF($A8=\"\",\"\",IF($P8=0,0,(IF($Q8=\"ja\",IF($K8>SozialV!$G8,((SozialV!$G8*SozialV!$F8/2)+(SozialV!$G8*$R8)),($K8*SozialV!$F8/2)+($K8*$R8)),IF($K8>SozialV!$G8,(SozialV!$G8*SozialV!$F8)/2,($K8*SozialV!$F8)/2)))))","v":0},{"$f":"IF(A8=\"\",\"\",IF(K8>SozialV!K8,(SozialV!K8*SozialV!I8)/2,(K8*SozialV!I8)/2))","v":593.72500000000002},{"$f":"IF(A8=\"\",\"\",IF(K8>SozialV!K8,(SozialV!K8*SozialV!J8)/2,(K8*SozialV!J8)/2))","v":95.25},{"$f":"ROUND(SUM(P8:U8),2)","v":688.98},{"$f":"K8-O8-V8","v":4813.2200000000012},{"$f":"ANDaten2!O8","v":0},{"$f":"ANDaten2!P8","v":0},{"$f":"W8-X8-Y8","v":4813.2200000000012},{"$f":"IF(A8=\"\",\"\",IF(Q8=\"nein\",V8,V8-(IF(K8>SozialV!G8,((SozialV!G8*SozialV!$E$6)+(SozialV!G8*GehaltsL1!R8)),((GehaltsL1!K8*SozialV!$E$6)+(GehaltsL1!K8*GehaltsL1!R8))))))","v":688.98}]
{"$rows_left_out":31}
{"sheet":"GehaltsL2","index":5,"n_rows":38,"n_cols":16,"rows_kept":38,"cut":false,"hidden":false,"merged":[[37,0,37,2],[1,10,1,12],[4,10,4,15],[1,13,1,15],[2,10,3,15],[1,0,1,2],[5,5,6,5],[1,3,3,7]]}
[]
["Gehaltsliste 2",null,null,"Wählen Sie zum Ausdruck der Gehaltsliste in Ihrem Druckmenu nur Sie Seite 1 aus.",null,null,null,null,null,null,"Buchungen"]
["Daten der Finanzbuchhaltung"]
[]
["Abrechnungsmonat:",null,{"$f":"GehaltsL1!C5","v":"Januar"},"Jahr:",{"$f":"GehaltsL1!E5","v":2017},null,null,null,null,null,"Entnehmen Sie die Gehaltslistensummen der Zeile 38"]
["Personal-",null,null,"Vertrags-","Urlaubs-","monatl. Prämien",null,"Brutto-","Steuer","SozVers.","Netto-",null,"Vorsch.",null,"AGAnteil","SV-Voraus-"]
["Nummer","Name","Vorname","gehalt","geld",null,"vwLAG","gehalt","gesamt","gesamt","gehalt","vwLAN","so. Abz.","Auszahlung","SozVers.","zahlung"]
[{"$f":"GehaltsL1!A8:C8","v":100},{"$f":"GehaltsL1!B8","v":"Sommer"},{"$f":"GehaltsL1!C8","v":"Sylvia"},{"$f":"GehaltsL1!G8","v":8500},{"$f":"GehaltsL1!H8","v":0},{"$f":"GehaltsL1!I8","v":0},{"$f":"GehaltsL1!J8","v":0},{"$f":"GehaltsL1!K8","v":8500},{"$f":"GehaltsL1!O8","v":2997.7999999999997},{"$f":"GehaltsL1!V8","v":688.98},{"$f":"GehaltsL1!W8","v":4813.2200000000012},{"$f":"GehaltsL1!X8","v":0},{"$f":"GehaltsL1!Y8","v":0},{"$f":"GehaltsL1!Z8","v":4813.2200000000012},{"$f":"GehaltsL1!AA8","v":688.98},{"$f":"IF(A8=\"\",\"\",J8+O8)","v":1377.96}]
{"$rows_left_out":31}
{"sheet":"Kontierung","index":6,"n_rows":56,"n_cols":6,"rows_kept":56,"cut":false,"hidden":false,"merged":[[1,0,1,2],[16,0,16,2],[16,3,16,5],[26,0,26,2],[26,3,26,5],[24,0,25,2],[1,3,1,5],[14,0,15,2],[2,3,3,5],[14,5,15,5],[4,3,4,5],[5,3,5,5],[8,5,9,5],[10,0,10,2],[10,3,10,5],[8,0,9,3],[24,5,25,5],[30,5,31,5],[44,2,44,5],[32,0,32,2],[32,3,32,5],[30,0,31,2]]}
[]
["Kontierung",null,null,"Eingabe der Buchungssätze"]
["Buchungen lt. Gehaltsliste",null,null,"1. Durch Klick auf die Buttons. (Entnehmen Sie die Beträge der Gehaltsliste.)"]
[]
[null,null,null,"2. Durch Direkteingabe in diesem Arbeitsblatt."]
[null,null,null,"3. Über die Buttons in der Gehaltsliste."]
[]
["Monat:",{"$f":"GehaltsL1!$C$5","v":"Januar"},"Jahr:",{"$f":"GehaltsL1!$E$5","v":2017}]
{"$rows_left_out":49}
{"sheet":"PersKarte","index":7,"n_rows":52,"n_cols":7,"rows_kept":52,"cut":false,"hidden":false,"merged":[[1,3,1,4],[15,3,17,3],[15,4,17,4],[1,6,1,7],[2,6,4,7],[11,6,13,7],[8,6,9,7]]}
[]
["Personalkarte",null,null,"Tropic GmbH, Rheingrafenstr. 20, 55543 Bad Kreuznach",null,null,"Personalkarte"]
[null,null,null,null,null,null,"Klicken Sie zur Erstellung der Personalkarte auf den Button, und geben Sie die Personalnummer ein."]
["Personalnummer",115]
[]
["Name",{"$f":"VLOOKUP($B$4,ANDaten1!$A$8:$W$31,2)","v":"Wagner"},null,"Telefon",{"$f":"VLOOKUP($B$4,ANDaten1!$A$8:$W$31,7)","v":"067316576"}]
["Vorname",{"$f":"VLOOKUP($B$4,ANDaten1!$A$8:$W$31,3)","v":"Christa"},null,"mobil",{"$f":"VLOOKUP($B$4,ANDaten1!$A$8:$W$31,8)","v":"017198877665"}]
["Straße, Nr.",{"$f":"VLOOKUP($B$4,ANDaten1!$A$8:$W$31,4)","v":"Ellerbachblick 1"},null,"Fax",{"$f":"VLOOKUP($B$4,ANDaten1!$A$8:$W$31,9)","v":"06731657-20"}]
{"$rows_left_out":45}
{"sheet":"LGAbrechnung","index":8,"n_rows":20,"n_cols":13,"rows_kept":20,"cut":false,"hidden":false,"merged":[[1,12,1,14],[2,7,2,8],[12,0,12,1],[10,6,10,9],[11,6,11,9],[9,0,9,1],[1,6,1,10],[8,3,8,4],[12,3,12,4],[4,0,4,5],[3,0,3,5],[2,12,4,14],[16,0,16,1],[5,0,5,5],[13,0,14,0],[13,1,14,1],[11,0,11,1],[11,3,11,5],[8,0,8,1],[6,0,6,5],[9,4,9,5],[10,0,10,1],[19,0,19,5],[17,2,17,5],[18,2,18,5],[17,0,17,1],[18,0,18,1],[18,6,18,9],[13,4,14,4],[13,5,14,5],[13,6,14,6],[13,7,14,7],[16,6,16,9],[16,2,16,5],[13,3,14,3],[13,2,14,2],[13,9,14,9],[13,10,14,10],[12,6,12,9],[13,8,14,8],[8,12,10,14],[9,6,9,9],[8,6,8,9]]}
[]
["Tropic GmbH, Rheingrafenstr. 20, 55543 Bad Kreuznach",null,null,null,null,null,"Lohn-/Gehaltsabrechnung",null,null,null,null,null,"Gehaltsabrechnung"]
[{"$f":"IF(VLOOKUP($I$5,ANDaten1!$A$8:$W$37,14)=\"männlich\",\"Herr\",\"Frau\")","v":"Frau"},null,null,null,null,null,"Monat:","Januar",null,"Datum:",{"$f":"TODAY()","v":"2020-08-28"},null,"Klicken Sie zur Aufstellung der Gehaltsabrechnung auf den Button, und geben Sie die erforderlichen Daten ein."]
[{"$f":"CONCATENATE(VLOOKUP($I$5,ANDaten1!$A$8:$W$37,3),\" \",(VLOOKUP($I$5,ANDaten1!$A$8:$W$37,2)))","v":"Diana Minardi"},null,null,null,null,null,"Jahr:",null,2017]
[{"$f":"VLOOKUP($I$5,ANDaten1!$A$8:$W$37,4)","v":"Kuhfeld 20"},null,null,null,null,null,"Personal-Nr.:",null,102]
[{"$f":"CONCATENATE(VLOOKUP($I$5,ANDaten1!$A$8:$W$37,5),\" \",(VLOOKUP($I$5,ANDaten1!$A$8:$W$37,6)))","v":"55594 Rüdesheim"},null,null,null,null,null,"Lohngruppe:",null,"------"]
[null,null,null,null,null,null,"Gehaltsgruppe:",null,{"$f":"VLOOKUP($I$5,ANDaten2!$A$8:$Q$37,10)","v":"F2"}]
[null,null,null,null,null,null,null,null,null,null,"€"]
{"$rows_left_out":13}
{"sheet":"Lohnsteuer","index":9,"n_rows":61,"n_cols":8,"rows_kept":61,"cut":false,"hidden":false,"merged":[[0,7,0,10],[11,5,12,5],[48,3,49,4],[48,5,49,5],[44,3,45,4],[44,5,45,5],[46,3,47,4],[46,5,47,5],[26,5,27,5],[40,5,41,5],[25,7,28,10],[1,7,3,10],[8,7,10,10],[12,7,14,10],[16,7,18,10],[20,7,23,10],[10,3,10,4],[11,3,12,4],[14,3,15,4],[16,3,17,4],[20,5,21,5],[18,3,18,4],[19,3,19,4],[20,3,21,4],[13,3,13,4],[14,5,15,5],[16,5,17,5],[3,3,4,4],[5,3,6,4],[7,3,7,4],[8,3,8,4],[9,3,9,4],[60,3,60,4],[59,3,59,5],[34,3,35,4],[34,5,35,5],[36,3,37,4],[36,5,37,5],[38,5,39,5],[40,3,41,4],[42,3,43,4],[50,3,51,4],[50,5,51,5],[24,5,25,5],[22,5,23,5],[28,0,29,0],[28,1,29,1],[28,5,29,5],[26,3,29,3],[26,4,27,4],[28,4,29,4],[22,3,23,4],[24,3,25,4],[30,3,31,4],[30,5,31,5],[32,3,33,4],[32,5,33,5],[42,5,43,5],[38,3,39,4]]}
[{"$f":"CONCATENATE(\"Ausdruck der elektronischen Lohnsteuerbescheinigung für\",\"  \",GehaltsL1!E5)","v":"Ausdruck der elektronischen Lohnsteuerbescheinigung für  2017"},null,null,null,null,null,null,"Lohnsteuerbescheinigung"]
["Nachstehende Daten wurden maschinell an die Finanzverwaltung übertragen",null,null,null,null,null,null,"Klicken Sie auf den Button um die Lohnsteuer- bescheinigung für ein ausgewähltes Jahr zu erstellen"]
[]
["Tropic GmbH, Rheingrafenstr. 20, 55543 Bad Kreuznach",null,null,"1. Dauer des Dienstverhältnisses",null,"vom - bis"]
[null,null,null,null,null,"01.01.-31.12."]
[{"$f":"IF(VLOOKUP($B$18,ANDaten1!$A$8:$W$37,14)=\"männlich\",\"Herr\",\"Frau\")","v":"Herr"},null,null,"2. Zeiträume ohne Anspruch auf Arbeitslohn",null,"Anzahl \"U\":"]
[{"$f":"CONCATENATE(VLOOKUP(B18,ANDaten1!A8:F37,3),\" \",(VLOOKUP(B18,ANDaten1!A8:F37,2)))","v":"Heiner Herbst"}]
[{"$f":"VLOOKUP($B$18,ANDaten1!$A$8:$F$37,4)","v":"Nußriede 20"},null,null,"3. Bruttoarbeitslohn einschl. Sachbezüge ohne 9. und 10.",null,{"$f":"A52*(VLOOKUP($B$18,GehaltsL1!$A$8:$N$37,7))+A52*(VLOOKUP($B$18,GehaltsL1!$A$8:$N$37,9))+A52*(VLOOKUP($B$18,GehaltsL1!$A$8:$N$37,10))-(A55*GehaltsL1!J8)+A43+A46","v":69080}]
{"$rows_left_out":54}
{"sheet":"SozialV","index":10,"n_rows":37,"n_cols":12,"rows_kept":37,"cut":false,"hidden":false,"merged":[[1,10,3,10],[5,7,5,8],[1,0,1,1],[1,7,3,8],[1,6,3,6]]}
[]
["Sozialversicherung",null,"Personendaten eigeben",null,null,null,null,"Bei Krankverversicherungspflicht wird mit einem einheitlichen Zusatzbeitragssatz gerechnet. "]
["Beitragsätze",null,"1. Schaltfläche 'Sozialversicherung' anklicken "]
[null,null,"2. Gültige Beitragssätze eingeben. (Krankenversicherung über 'Arbeitnehmerdaten'.)"]
[]
[null,null,null,"Krankenversicherung         Zusatzbeitragssatz:",1.0999999999999999E-2,"Pflegeversicherung","Beitragsbemessungsgrenze","Rentenversicherung",null,"Arbeitslosenversicherung","Beitragsbemessungsgrenze"]
["Personalnummer","Name","Vorname","Krankenkasse","Beitragssatz","Beitragssatz","Kranken- u. Pflegevers.","Täger","Beitragssatz","Beitragssatz","Renten- u. Arbeitslosenvers.","Sozialversicherungsnummer"]
[{"$f":"ANDaten1!A8","v":100},{"$f":"ANDaten1!B8","v":"Sommer"},{"$f":"ANDaten1!C8","v":"Sylvia"},"privat",0,2.5499999999999998E-2,4350,{"$f":"IF(A8=\"\",\"\",\"Deutsche Rentenversicherung\")","v":"Deutsche Rentenversicherung"},0.187,0.03,6350,"53120754S654"]
{"$rows_left_out":30}
{"sheet":"Urlaub","index":11,"n_rows":40,"n_cols":39,"rows_kept":40,"cut":false,"hidden":false,"merged":[[8,36,8,37],[6,34,6,38],[8,38,9,38],[1,0,1,2],[8,0,9,0],[8,3,8,4],[8,5,8,35],[7,4,7,6],[8,1,9,1],[8,2,9,2],[6,0,6,1],[5,0,5,1]]}
[]
["Urlaubsplanung",null,null,"Klicken Sie auf den entsprechenden Button um Planungsjahr und Planungmonat einzugeben."]
[null,null,null,"Benutzen Sie zur Unterscheidung der Werk-, Sonn- und Feiertage einen aktuellen Kalender. "]
[null,null,null,"(Einen Jahreskalender als Excel-Tabelle finden Sie auf der CD.)"]
[null,null,null,"Nehmen Sie die Urlaubsplanung durch geeignete Symbole vor."]
["Planungsjahr:",null,2017,null,"z.B.:"," ","=","Urlaubstage",null,null,null,"W","=","Werktage",null,null,"Sa","=","Samstag",null,null,"So","=","Sonntag",null,null,"F","=","Feiertag"]
["Planungsmonat:",null,"Juli","Tragen Sie die in Anspruch genommenen Urlaubstage für den aktuellen Monat und die Vormonate ein."]
[]
{"$rows_left_out":33}
{"sheet":"Briefe","index":12,"n_rows":59,"n_cols":9,"rows_kept":59,"cut":false,"hidden":false,"merged":[[58,1,58,6],[18,1,18,4],[20,1,20,3],[57,1,57,6],[0,8,1,11],[2,8,5,11],[3,1,3,3],[12,8,13,11],[9,8,11,11],[11,5,11,6],[9,1,9,3],[9,5,9,6],[8,5,8,6],[10,5,10,6],[7,1,7,3],[6,1,6,3],[7,5,7,6]]}
[null,null,null,null,null,null,null,null,"Briefe an das Personal"]
[null,"Tropic GmbH, Rheingrafenstr. 20, 55543 Bad Kreuznach"]
[null,null,null,null,null,null,null,null,"Klicken Sie auf den Button und geben Sie die Personalnummer, Versendungsform und Angaben der Bezugszeile ein, und wählen Sie einen Betreff aus."]
[]
[]
[null,{"$f":"IF(VLOOKUP($B$17,ANDaten1!$A$8:$W$37,14)=\"männlich\",\"Herr\",\"Frau\")","v":"Herr"}]
[null,{"$f":"CONCATENATE(VLOOKUP($B$17,ANDaten1!$A$8:$W$37,3),\" \",(VLOOKUP($B$17,ANDaten1!$A$8:$W$37,2)))","v":"Heiner Herbst"}]
[null,{"$f":"VLOOKUP($B$17,ANDaten1!$A$8:$W$37,4)","v":"Nußriede 20"},null,null,null,"Rheingrafenstr. 20"]
{"$rows_left_out":52}
{"sheet":"Steuer","index":13,"n_rows":243,"n_cols":34,"rows_kept":243,"cut":false,"hidden":true,"merged":[[0,32,0,34]]}
["PersNr.:",100,"PersNr.:",101,102,103,104,105,106,107,108,109,110,111,112,113,114,115,116,117,118,119,120,121,122,123,124,125,126,127,128,128,"Lohnsteuer für Zusatzentgelte"]
["Eingangsparameter",null,null,null,null,null,null,null,null,null,null,null,null,null,null,null,null,null,null,null,null,null,null,null,null,null,null,null,null,null,null,null,"Eingangsparameter"]
["AJAHR",0,null,0,0,0,0,0,0,0,0,0,0,0,0,0,0,0,0,0,0,0,0,0,0,0,0,0,0,0,0,0,"AJAHR",0]
["ALTER1",0,null,0,0,0,0,0,0,0,0,0,0,0,0,0,0,0,0,0,0,0,0,0,0,0,0,0,0,0,0,0,"ALTER1",0]
["HINZUR",0,null,0,0,0,0,0,0,0,0,0,0,0,0,0,0,0,0,0,0,0,0,0,0,0,0,0,0,0,0,0,"HINZUR",0]
["KRV",0,null,0,0,0,0,0,0,0,0,0,0,0,0,0,0,0,0,0,0,0,0,0,0,0,0,0,0,0,0,0,"KRV",0]
["LZZ",2,null,2,2,2,2,2,2,2,2,2,2,2,2,2,2,2,2,2,2,2,2,2,2,2,2,2,2,2,2,2,"LZZ",2]
["R",1,null,1,1,1,1,1,1,1,1,1,1,1,1,1,1,1,1,1,1,1,1,1,1,1,1,1,1,1,1,1,"R",1]
{"$rows_left_out":236}
{"sheet":"Steuer2017","index":14,"n_rows":265,"n_cols":34,"rows_kept":265,"cut":false,"hidden":true,"merged":[[0,32,0,34]]}
["PersNr.:",100,"PersNr.:",101,102,103,104,105,106,107,108,109,110,111,112,113,114,115,116,117,118,119,120,121,122,123,124,125,126,127,128,129,"Lohnsteuer für Zusatzentgelte"]
["Eingangsparameter",null,null,null,null,null,null,null,null,null,null,null,null,null,null,null,null,null,null,null,null,null,null,null,null,null,null,null,null,null,null,null,"Eingangsparameter"]
["AF",0,null,0,0,0,0,0,0,0,0,0,0,0,0,0,0,0,0,0,0,0,0,0,0,0,0,0,0,0,0,0,"AF",0]
["AJAHR",0,null,0,0,0,0,0,0,0,0,0,0,0,0,0,0,0,0,0,0,0,0,0,0,0,0,0,0,0,0,0,"AJAHR",0]
["ALTER1",0,null,0,0,0,0,0,0,0,0,0,0,0,0,0,0,0,0,0,0,0,0,0,0,0,0,0,0,0,0,0,"ALTER1",0]
["F",0,null,0,0,0,0,0,0,0,0,0,0,0,0,0,0,0,0,0,0,0,0,0,0,0,0,0,0,0,0,0,"F",0]
["KRV",2,null,2,2,2,2,2,2,2,2,2,2,2,2,2,2,2,2,2,2,2,2,2,2,2,2,2,2,2,2,2,"KRV",2]
["KVZ",{"$f":"IF(SozialV!$E8>0,SozialV!$E$6*100,0)","v":0},null,{"$f":"IF(SozialV!$E9>0,SozialV!$E$6*100,0)","v":1.0999999999999999},{"$f":"IF(SozialV!$E10>0,SozialV!$E$6*100,0)","v":1.0999999999999999},{"$f":"IF(SozialV!$E11>0,SozialV!$E$6*100,0)","v":1.0999999999999999},{"$f":"IF(SozialV!$E12>0,SozialV!$E$6*100,0)","v":1.0999999999999999},{"$f":"IF(SozialV!$E13>0,SozialV!$E$6*100,0)","v":1.0999999999999999},{"$f":"IF(SozialV!$E14>0,SozialV!$E$6*100,0)","v":1.0999999999999999},{"$f":"IF(SozialV!$E15>0,SozialV!$E$6*100,0)","v":1.0999999999999999},{"$f":"IF(SozialV!$E16>0,SozialV!$E$6*100,0)","v":1.0999999999999999},{"$f":"IF(SozialV!$E17>0,SozialV!$E$6*100,0)","v":1.0999999999999999},{"$f":"IF(SozialV!$E18>0,SozialV!$E$6*100,0)","v":1.0999999999999999},{"$f":"IF(SozialV!$E19>0,SozialV!$E$6*100,0)","v":1.0999999999999999},{"$f":"IF(SozialV!$E20>0,SozialV!$E$6*100,0)","v":1.0999999999999999},{"$f":"IF(SozialV!$E21>0,SozialV!$E$6*100,0)","v":1.0999999999999999},{"$f":"IF(SozialV!$E22>0,SozialV!$E$6*100,0)","v":1.0999999999999999},{"$f":"IF(SozialV!$E23>0,SozialV!$E$6*100,0)","v":1.0999999999999999},{"$f":"IF(SozialV!$E24>0,SozialV!$E$6*100,0)","v":1.0999999999999999},{"$f":"IF(SozialV!$E25>0,SozialV!$E$6*100,0)","v":1.0999999999999999},{"$f":"IF(SozialV!$E26>0,SozialV!$E$6*100,0)","v":1.0999999999999999},{"$f":"IF(SozialV!$E27>0,SozialV!$E$6*100,0)","v":1.0999999999999999},{"$f":"IF(SozialV!$E28>0,SozialV!$E$6*100,0)","v":0},{"$f":"IF(SozialV!$E29>0,SozialV!$E$6*100,0)","v":0},{"$f":"IF(SozialV!$E30>0,SozialV!$E$6*100,0)","v":0},{"$f":"IF(SozialV!$E31>0,SozialV!$E$6*100,0)","v":0},{"$f":"IF(SozialV!$E32>0,SozialV!$E$6*100,0)","v":0},{"$f":"IF(SozialV!$E33>0,SozialV!$E$6*100,0)","v":0},{"$f":"IF(SozialV!$E34>0,SozialV!$E$6*100,0)","v":0},{"$f":"IF(SozialV!$E35>0,SozialV!$E$6*100,0)","v":0},{"$f":"IF(SozialV!$E36>0,SozialV!$E$6*100,0)","v":0},{"$f":"IF(SozialV!$E37>0,SozialV!$E$6*100,0)","v":0},"KVZ",{"$f":"IF(SozialV!$E37>0,SozialV!$E$6*100,0)","v":0}]
{"$rows_left_out":257}